{"text_format":"1","workbook":"xlsx","n_sheets":6,"sheets":["Eingabe","Auswahl","Berechnung","Daten","Anfrage","Menü"],"not_rendered":{"charts":0,"images":26,"macros":1,"external_links":0,"defined_names":14,"comments":2,"pivot_tables":0},"unopened":[],"bounds":{"document_bytes":16777216,"sheet_cells":100000,"rows_first":2000,"rows_last":500,"rows_between":2000,"halvings":0,"cell_chars":16384,"cell_head_chars":4096},"cells_cut":0,"cells_raw":0,"read":"whole","date_system":"1900"}

{"sheet":"Eingabe","index":0,"n_rows":12,"n_cols":3,"rows_kept":12,"cut":false,"hidden":false,"merged":[]}
[]
[null,"Bitte geben Sie hier Ihre vollständige Adresse ein:"]
[]
[null,"Firma:","Musterfirma"]
[null,"Straße:","Musterstraße"]
[null,"PLZ:","07549"]
[null,"Ort:","Musterhausen"]
[]
[null,"Ansprechpartner:","Herr Muster Mustermann"]
[null,"Tel.:","0049 1234567889"]
[null,"Fax:","0049 34567654"]
[null,"Email.:","muster@muster.de"]

{"sheet":"Auswahl","index":1,"n_rows":85,"n_cols":9,"rows_kept":85,"cut":false,"hidden":false,"merged":[[1,1,1,8],[0,1,0,7]]}
[null,"Konfigurator zur Bestimmung der Schlauchfangsicherungsbauteile "]
[null,"Stand: 24.05.2013 "]
[]
[]
[null,"Eingabe Schlauchdaten:"]
[]
[]
[null,"Bezeichnung","Größe",null,null,null,"Außendurchmesser"]
[]
[]
[]
[]
[null,"Eingabe Armaturdaten:"]
[]
[]
[null,"Anschluss","Anschlussgröße"]
[]
[]
[]
[]
[null,"E-Maß","B-Maß","L-Maß",null,null,"Art.-Nr."]
[]
[]
[]
[]
[]
[]
[]
[]
[]
[]
[]
[]
[]
[]
[null,"Ausgabe Schlauchfangsicherungdaten:"]
[]
[null,"Schlauchschelle","Seillager","Fangseil","Lasche","Klettbandbinder "]
[null,{"$f":"Berechnung!C9","v":{"$error":"#N/A"}},{"$f":"Berechnung!A19","v":{"$error":"#N/A"}},{"$f":"Berechnung!H24","v":{"$error":"#N/A"}},{"$f":"Berechnung!B14","v":{"$error":"#N/A"}},{"$f":"Berechnung!E29","v":{"$error":"#N/A"}}]
[null,{"$f":"Berechnung!D9","v":{"$error":"#N/A"}},{"$f":"Berechnung!B19","v":{"$error":"#N/A"}},{"$f":"Berechnung!I24","v":{"$error":"#N/A"}},{"$f":"Berechnung!C14","v":{"$error":"#N/A"}},{"$f":"Berechnung!F29","v":{"$error":"#N/A"}}]
{"$rows_left_out":46}
{"sheet":"Berechnung","index":2,"n_rows":40,"n_cols":15,"rows_kept":40,"cut":false,"hidden":false,"merged":[[23,12,23,19],[4,12,4,19]]}
["Makros"]
[]
["ODER \nSchlauchdaten","ODER\nArmaturdaten"]
[0,0]
[null,null,null,null,null,null,null,null,null,null,null,null,"Formel zur Berechnung der Fangseillänge"]
["Schlauchschelle"]
[]
["Eingabe\n Schlauchdaten","Außendurch-\nmesser","Schlauchschelle\nKurztext","Schlauchschelle\nArtikel"]
[{"$f":"IF(A4=0,Auswahl!B9&Auswahl!C9,Auswahl!G9)","v":""},{"$f":"IF(A4=0,VLOOKUP(A9,Daten!$C:$D,2,FALSE),A9)","v":{"$error":"#N/A"}},{"$f":"VLOOKUP($B$9,Daten!$F:$O,3,TRUE)","v":{"$error":"#N/A"}},{"$f":"VLOOKUP($B$9,Daten!$F:$O,4,TRUE)","v":{"$error":"#N/A"}}]
[]
["Lasche"]
[]
["Eingabe\nArmaturdaten","Lasche\nKurztext","Lasche\nArtikel"]
[{"$f":"Auswahl!B17&Auswahl!C17","v":""},{"$f":"VLOOKUP($A$14,Daten!$S:$V,3,FALSE)","v":{"$error":"#N/A"}},{"$f":"VLOOKUP($A$14,Daten!$S:$V,4,FALSE)","v":{"$error":"#N/A"}}]
[]
["Seillager"]
[]
["Seillager\nKurztext","Seillager\nArtikel"]
[{"$f":"VLOOKUP($D$9,Daten!$I:$O,5,FALSE)","v":{"$error":"#N/A"}},{"$f":"VLOOKUP($D$9,Daten!$I:$O,6,FALSE)","v":{"$error":"#N/A"}}]
[]
["Fangseil",null,null,null,null,null,null,null,null,null,null,null,null,"Legende: ","E-, L-, und B-Maße aus Dietzel Katalog (Armaturen)"]
[]
["Eingabe\n Armaturdaten","E-Maß","B-Maß","L-Maß","Seildurchmesser","Seillänge\nberechnet","Seillänge\naufgerundet","Fangseil\nKurztext","Fangseil\nArtikel"]
[{"$f":"IF(B4=0,Auswahl!B22&\"/\"&Auswahl!C22&\"/\"&Auswahl!D22,Auswahl!G22)","v":"//"},{"$f":"IF($B$4=0,Auswahl!B22,VLOOKUP(Auswahl!$G$22,Daten!$X:$AA,2,FALSE))","v":0},{"$f":"IF($B$4=0,Auswahl!C22,VLOOKUP(Auswahl!$G$22,Daten!$X:$AA,3,FALSE))","v":0},{"$f":"IF($B$4=0,Auswahl!D22,VLOOKUP(Auswahl!$G$22,Daten!$X:$AA,4,FALSE))","v":0},{"$f":"VLOOKUP($B$19,Daten!$N:$O,2,FALSE)","v":{"$error":"#N/A"}},{"$f":"IF(OR(C24<=0,D24<=0)=TRUE,\"0\",25+2*SQRT(POWER(B24,2)+POWER(45+D24,2))+2*(D24-C24)+8.5*B9)","v":"0"},{"$f":"ROUNDUP(F24,-2)","v":0},{"$f":"VLOOKUP($E$24&IF($G$24<1000,\"0\"&$G$24,$G$24),Daten!$AC:$AE,2,FALSE)","v":{"$error":"#N/A"}},{"$f":"VLOOKUP($E$24&IF($G$24<1000,\"0\"&$G$24,$G$24),Daten!$AC:$AE,3,FALSE)","v":{"$error":"#N/A"}},null,null,null,"*Seilumschlingung Schlauch (Schlaufe)"]
[]
["Klettbandbinder",null,null,null,null,null,null,null,null,null,null,null,null,"Es besteht ein direktes Verhältnis zwischen Seilumschlingung Schlauch und"]
[null,null,null,null,null,null,null,null,null,null,null,null,null,"Schlauchumfang"]
["Fassungs-\ndurchmesser","Fassungs-\numfang","Klettbandbreite","Klettbandlänge","Klettbandbinder\nKurztext","Klettbandbinder\nArtikel"]
[{"$f":"B9+3","v":{"$error":"#N/A"}},{"$f":"A29*PI()","v":{"$error":"#N/A"}},{"$f":"IF(D24*C24=0,0,IF(D24-C24<=40,25,50))","v":0},{"$f":"IF(C29=25,VLOOKUP($B$29,Daten!AH1:AK3,4,TRUE),IF(C29=50,VLOOKUP($B$29,Daten!AH4:AK8,4,TRUE),0))","v":0},{"$f":"VLOOKUP($C$29&$D$29,Daten!$AG$1:$AM$8,6,FALSE)","v":{"$error":"#N/A"}},{"$f":"VLOOKUP($C$29&$D$29,Daten!$AG$1:$AM$8,7,FALSE)","v":{"$error":"#N/A"}}]
[]
["Bestellnummer Schlauchfangsicherung Dietzel"]
[]
["Eingabe\nArmaturdaten","Bestellnummer"]
[{"$f":"Auswahl!B17","v":0},{"$f":"\"S\"&IF(OR($A$34=\"DKO_CE.standard\",$A$34=\"DKO_CE.geteilt\"),\"D\",\"F\")&\"-\"&MID(C9,8,2)&MID(C9,11,2)&\"-\"&IF(LEN($C$14)=4,MID($C$14,2,3),MID($C$14,2,4))&\"-\"&\"SL\"&MID($I$24,IF($G$24<1000,7,6),IF($G$24<1000,3,4))","v":{"$error":"#N/A"}}]
[]
[]
[]
[]
[]
[null,null,null,null,null,null,null,null,null,null,null,null,null,null,"oder:"]
{"$rows_left_out":1}
{"sheet":"Daten","index":3,"n_rows":751,"n_cols":59,"rows_kept":751,"cut":false,"hidden":false,"merged":[]}
["1SC",6,{"$f":"A1&\"DN\"&B1","v":"1SCDN6"},12,null,7.5,8.5,"HASFS-008008","HASFS-029"," -",{"$f":"MID(H1,8,2)&MID(H1,11,2)","v":"0808"},"M 5","SEILLAGER KLEIN","SLK",3,null,"DKO_CE.standard","6L",{"$f":"Q1&R1","v":"DKO_CE.standard6L"},"M 12","Lasche DIN 6L","D125",null,"1.011-12-12",null,30,67,null,{"$f":"MID(AE1,4,1)&MID(AE1,6,4)","v":"30400"},"STAHLDRAHTSEIL 3MM + KUGEL 8MM","SDS3-0400KONF",null,{"$f":"AJ1&AK1","v":"25120"},0,70,25,120,"KBB25-120","KBB25-120",null,"Schellen","EK","Seillager","HK","Seile","EK","Laschen","HK","Klettband","EK",null,"1SC","DN6","DKO_CE.standard","6L","M 30","2\"","6L","3000PSI_1/2\""]
["1SC",8,"1SCDN8",14,null,8.5,9.5,"HASFS-009009","HASFS-023"," -",{"$f":"MID(H2,8,2)&MID(H2,11,2)","v":"0909"},"M 5","SEILLAGER KLEIN","SLK",3,null,"DKO_CE.standard","8L","DKO_CE.standard8L","M 14","Lasche DIN 6S/8L","D145",null,"1.011-12-16",null,34,81,null,"30500","STAHLDRAHTSEIL 3MM + KUGEL 8MM","SDS3-0500KONF",null,"25150",70,100,25,150,"KBB25-150","KBB25-150",null,"HASFS-001",null,"SLK",null,"SDS3-0400KONF",null,"D125",null,"KBB25-120",null,null,"1SN","DN8","DKM_AGM.standard","8L","M 45","3\"","8L","3000PSI_3/4\""]
["1SC",10,"1SCDN10",15.6,null,9.5,10.5,"HASFS-010010","HASFS-027"," -",{"$f":"MID(H3,8,2)&MID(H3,11,2)","v":"1010"},"M 5","SEILLAGER KLEIN","SLK",3,null,"DKO_CE.standard","10L","DKO_CE.standard10L","M 16","Lasche DIN 8S/10L","D165",null,"1.011-16-12",null,28,80,null,"30600","STAHLDRAHTSEIL 3MM + KUGEL 8MM","SDS3-0600KONF",null,"25200",100,150,25,200,"KBB25-200","KBB25-200",null,"HASFS-002",null,"SLG",null,"SDS3-0500KONF",null,"D145",null,"KBB25-150",null,null,"2SC","DN10","DKR_AGR.standard","10L","M 52",null,"10L","3000PSI_1\""]
["1SC",12,"1SCDN12",18.8,null,10.5,11.5,"HASFS-011011","HASFS-028"," -",{"$f":"MID(H4,8,2)&MID(H4,11,2)","v":"1111"},"M 5","SEILLAGER KLEIN","SLK",3,null,"DKO_CE.standard","12L","DKO_CE.standard12L","M 18","Lasche DIN 10S/12L","D185",null,"1.011-16-16",null,35,82,null,"30700","STAHLDRAHTSEIL 3MM + KUGEL 8MM","SDS3-0700KONF",null,"50150",0,100,50,150,"KBB50-150","KBB50-150",null,"HASFS-003",null,null,null,"SDS3-0600KONF",null,"D165",null,"KBB25-200",null,null,"2SN","DN12","DKO_CE.geteilt","12L","M 65",null,"12L","3000PSI_1_1/4\""]
["1SC",16,"1SCDN16",22,null,11.5,12.5,"HASFS-012012","HASFS-001","STOPFS-1414CONF",{"$f":"MID(H5,8,2)&MID(H5,11,2)","v":"1212"},"M 5","SEILLAGER KLEIN","SLK",3,null,"DKO_CE.standard","15L","DKO_CE.standard15L","M 22","Lasche DIN 14S/15L","D225",null,"1.011-16-20",null,35,96,null,"30800","STAHLDRAHTSEIL 3MM + KUGEL 8MM","SDS3-0800KONF",null,"50200",100,150,50,200,"KBB50-200","KBB50-200",null,"HASFS-004",null,null,null,"SDS3-0700KONF",null,"D185",null,"KBB50-150",null,null,"2SN-K","DN16","SAE","15L","M 78",null,"15L","3000PSI_1_1/2\""]
["1SC",19,"1SCDN19",26.1,null,12.5,13.5,"HASFS-013013","HASFS-002","STOPFS-1515CONF",{"$f":"MID(H6,8,2)&MID(H6,11,2)","v":"1313"},"M 5","SEILLAGER KLEIN","SLK",3,null,"DKO_CE.standard","18L","DKO_CE.standard18L","M 26","Lasche DIN 18L","D265",null,"1.011-20-16",null,36,89,null,"30900","STAHLDRAHTSEIL 3MM + KUGEL 8MM","SDS3-0900KONF",null,"50250",150,200,50,250,"KBB50-250","KBB50-250",null,"HASFS-005",null,null,null,"SDS3-0800KONF",null,"D205",null,"KBB50-200",null,null,"3SPC","DN19",null,"18L","M 90",null,"18L","3000PSI_2\""]
["1SC",25,"1SCDN25",33.6,null,13.5,14.5,"HASFS-014014","HASFS-003","STOPFS-1616CONF","1414","M 5","SEILLAGER KLEIN","SLK",3,null,"DKO_CE.standard","22L","DKO_CE.standard22L","M 30","Lasche DIN 20S/22L","D305",null,"1.011-20-20",null,42,96,null,"31000","STAHLDRAHTSEIL 3MM + KUGEL 8MM","SDS3-1000KONF",null,"50320",200,250,50,320,"KBB50-320","KBB50-320",null,"HASFS-006",null,null,null,"SDS3-0900KONF",null,"D225",null,"KBB50-250",null,null,"4SH","DN25",null,"22L","M 100",null,"22L","3000PSI_2_1/2\""]
["1SN",6,"1SNDN6",13.4,null,14.5,15.5,"HASFS-015015","HASFS-004","STOPFS-1717CONF","1515","M 5","SEILLAGER KLEIN","SLK",3,null,"DKO_CE.standard","28L","DKO_CE.standard28L","M 36","Lasche DIN 25S/28L","D365",null,"1.011-20-24",null,45,102,null,"31100","STAHLDRAHTSEIL 3MM + KUGEL 8MM","SDS3-1100KONF",null,"50370",250,300,50,370,"KBB50-370","KBB50-370",null,"HASFS-007",null,null,null,"SDS3-1000KONF",null,"D245",null,"KBB50-320",null,null,"4SP","DN31",null,"28L",null,null,"28L","3000PSI_3\""]
["1SN",8,"1SNDN8",15,null,15.5,16.5,"HASFS-016016","HASFS-005","STOPFS-1818CONF","1616","M 5","SEILLAGER KLEIN","SLK",3,null,"DKO_CE.standard","35L","DKO_CE.standard35L","M 45","Lasche DIN 35L","D455",null,"1.011-24-20",null,42,102,null,"31200","STAHLDRAHTSEIL 3MM + KUGEL 8MM","SDS3-1200KONF",null,"50420",300,350,50,420,"KLETTBANDBINDER 50 breit L=420 mm","KBB50-420",null,"HASFS-008",null,null,null,"SDS3-1100KONF",null,"D265",null,"KBB50-370",null,null,"6SP_560bar","DN38",null,"35L",null,null,"35L","3000PSI_3_1/2\""]
["1SN",10,"1SNDN10",17.399999999999999,null,16.5,17.5,"HASFS-017017","HASFS-006","STOPFS-1919CONF","1717","M 5","SEILLAGER KLEIN","SLK",3,null,"DKO_CE.standard","42L","DKO_CE.standard42L","M 52","Lasche DIN 38S/42L","D525",null,"1.011-24-24",null,45,102,null,"40800","STAHLDRAHTSEIL 4MM + KUGEL 10MM","SDS4-0800KONF",null," -",350,"-","-","-","-","-",null,"HASFS-009",null,null,null,"SDS3-1200KONF",null,"D305",null,null,null,null,"R13","DN51",null,"42L",null,null,"42L","6000PSI_1/2\""]
["1SN",12,"1SNDN12",20.6,null,17.5,20.5,"HASFS-018020","HASFS-007","STOPFA 2224CONF","1820","M 6","SEILLAGER KLEIN","SLK",3,null,"DKO_CE.standard","6S","DKO_CE.standard6S","M 14","Lasche DIN 6S/8L","D145",null,"1.011-24-32",null,59,134,null,{"$f":"MID(AE11,4,1)&MID(AE11,6,4)","v":"40900"},"STAHLDRAHTSEIL 4MM + KUGEL 10MM","SDS4-0900KONF",null,null,null,null,null,null,null,null,null,"HASFS-010",null,null,null,"SDS4-0800KONF",null,"D365",null,null,null,null,"R15","DN60",null,"6S",null,null,"6S","6000PSI_3/4\""]
["1SN",16,"1SNDN16",23.7,null,20.5,23.5,"HASFS-021023","HASFS-008","STOPFA 2527CONF","2123","M 6","SEILLAGER KLEIN","SLK",3,null,"DKO_CE.standard","8S",{"$f":"Q12&R12","v":"DKO_CE.standard8S"},"M 16","Lasche DIN 8S/10L","D165",null,"1.011-32-24",null,45,107,null,"41000","STAHLDRAHTSEIL 4MM + KUGEL 10MM","SDS4-1000KONF",null,null,null,null,null,null,null,null,null,"HASFS-011",null,null,null,"SDS4-0900KONF",null,"D425",null,null,null,null,null,"DN63",null,"8S",null,null,"8S","6000PSI_1\""]
["1SN",19,"1SNDN19",27.7,null,23.5,26.5,"HASFS-024026","HASFS-009","STOPFA 2830CONF","2426","M 6","SEILLAGER KLEIN","SLK",3,null,"DKO_CE.standard","10S","DKO_CE.standard10S","M 18","Lasche DIN 10S/12L","D185",null,"1.011-32-32",null,61,136,null,"41100","STAHLDRAHTSEIL 4MM + KUGEL 10MM","SDS4-1100KONF",null,null,null,null,null,null,null,null,null,"HASFS-012",null,null,null,"SDS4-1000KONF",null,"D455",null,null,null,null,null,"DN76",null,"10S",null,null,"10S","6000PSI_1_1/4\""]
["1SN",25,"1SNDN25",35.6,null,26.5,29.5,"HASFS-027029","HASFS-010","STOPFA 3133CONF","2729","M 6","SEILLAGER KLEIN","SLK",3,null,"DKO_CE.standard","12S","DKO_CE.standard12S","M 20","Lasche DIN 12S","D205",null,"1.011-32-36",null,76,156,null,"41200","STAHLDRAHTSEIL 4MM + KUGEL 10MM","SDS4-1200KONF",null,null,null,null,null,null,null,null,null,"HASFS-013",null,null,null,"SDS4-1100KONF",null,"D525",null,null,null,null,null,null,null,"12S",null,null,"12S","6000PSI_1_1/2\""]
["1SN",31,"1SNDN31",43.5,null,29.5,32.5,"HASFS-030032","HASFS-011","STOPFA 3436CONF","3032","M 6","SEILLAGER KLEIN","SLK",3,null,"DKO_CE.standard","14S","DKO_CE.standard14S","M 22","Lasche DIN 14S/15L","D225",null,"1.011-40-32",null,62,137,null,"41300","STAHLDRAHTSEIL 4MM + KUGEL 10MM","SDS4-1300KONF",null,null,null,null,null,null,null,null,null,"HASFS-014",null,null,null,"SDS4-1200KONF",null,"D600",null,null,null,null,null,null,null,"14S",null,null,"14S","6000PSI_2\""]
["1SN",38,"1SNDN38",50.6,null,32.5,35.5,"HASFS-033035","HASFS-012","STOPFA 3739CONF","3335","M 6","SEILLAGER KLEIN","SLK",3,null,"DKO_CE.standard","16S","DKO_CE.standard16S","M 24","Lasche DIN 16S","D245",null,"1.011-40-36",null,77,157,null,"41400","STAHLDRAHTSEIL 4MM + KUGEL 10MM","SDS4-1400KONF",null,null,null,null,null,null,null,null,null,"HASFS-015",null,null,null,"SDS4-1300KONF",null,"S085",null,null,null,null,null,null,null,"16S",null,null,"16S"]
["1SN",51,"1SNDN51",64,null,35.5,39.5,"HASFS-036039","HASFS-013","STOPFA 4043CONF","3639","M 6","SEILLAGER KLEIN","SLK",3,null,"DKO_CE.standard","20S","DKO_CE.standard20S","M 30","Lasche DIN 20S/22L","D305",null,"1.015-12-12",32,73,112,null,{"$f":"MID(AE17,4,1)&MID(AE17,6,4)","v":"41500"},"STAHLDRAHTSEIL 4MM + KUGEL 10MM","SDS4-1500KONF",null,null,null,null,null,null,null,null,null,"HASFS-016",null,null,null,"SDS4-1400KONF",null,"S105",null,null,null,null,null,null,null,"20S",null,null,"20S"]
["1SN-K",6,"1SN-KDN6",11.8,null,39.5,43.5,"HASFS-040043","HASFS-014","STOPFA 4447CONF","4043","M 6","SEILLAGER KLEIN","SLK",3,null,"DKO_CE.standard","25S","DKO_CE.standard25S","M 36","Lasche DIN 25S/28L","D365",null,"1.015-12-16",36,81,128,null,{"$f":"MID(AE18,4,1)&MID(AE18,6,4)","v":"41600"},"STAHLDRAHTSEIL 4MM + KUGEL 10MM","SDS4-1600KONF",null,null,null,null,null,null,null,null,null,"HASFS-017",null,null,null,"SDS4-1500KONF",null,"S125",null,null,null,null,null,null,null,"25S",null,null,"25S"]
["1SN-K",8,"1SN-KDN8",13.6,null,43.5,47.5,"HASFS-044047","HASFS-016","STOPFA 4851CONF/HD","4447","M 8","SEILLAGER GROß","SLG",4,null,"DKO_CE.standard","30S","DKO_CE.standard30S","M 42","Lasche DIN 30S","D425",null,"1.015-16-12",33,70,109,null,{"$f":"MID(AE19,4,1)&MID(AE19,6,4)","v":"41700"},"STAHLDRAHTSEIL 4MM + KUGEL 10MM","SDS4-1700KONF",null,null,null,null,null,null,null,null,null,"HASFS-018",null,null,null,null,null,"S145",null,null,null,null,null,null,null,"30S",null,null,"30S"]
["1SN-K",10,"1SN-KDN10",16.5,null,47.5,51.5,"HASFS-048051","HASFS-017","STOPFA 5255CONF","4851","M 8","SEILLAGER GROß","SLG",4,null,"DKO_CE.standard","38S","DKO_CE.standard38S","M 52","Lasche DIN 38S/42L","D525",null,"1.015-16-16",36,80,126,null,null,null,null,null,null,null,null,null,null,null,null,null,"HASFS-019",null,null,null,null,null,"S165",null,null,null,null,null,null,null,"38S",null,null,"38S"]
["1SN-K",12,"1SN-KDN12",19,null,51.5,56.5,"HASFS-052056","HASFS-018","STOPFA 5660CONF","5256","M 8","SEILLAGER GROß","SLG",4,null,"DKM_AGM.standard","M 30","DKM_AGM.standardM 30","M 30","Lasche DIN 20S/22L","D305",null,"1.015-16-20",40,115,169,null,null,null,null,null,null,null,null,null,null,null,null,null,"HASFS-020",null,null,null,null,null,"S205"]
["1SN-K",16,"1SN-KDN16",22.3,null,56.5,61.5,"HASFS-057061","HASFS-019","STOPFA 6165CONF","5761","M 8","SEILLAGER GROß","SLG",4,null,"DKM_AGM.standard","M 45","DKM_AGM.standardM 45","M 45","Lasche DIN 35L","D455",null,"1.015-20-16",35,79,125,null,null,null,null,null,null,null,null,null,null,null,null,null,"HASFS-021",null,null,null,null,null,"D125G",null,"angepaßt"]
["1SN-K",19,"1SN-KDN19",26.2,null,61.5,66.5,"HASFS-062066","HASFS-020","STOPFA 6670CONF","6266","M 8","SEILLAGER GROß","SLG",4,null,"DKM_AGM.standard","M 52","DKM_AGM.standardM 52","M 52","Lasche DIN 38S/42L","D525",null,"1.015-20-20",39,114,168,null,null,null,null,null,null,null,null,null,null,null,null,null,"HASFS-022",null,null,null,null,null,"D145G",null,"angepaßt"]
["1SN-K",25,"1SN-KDN25",34,null,66.5,72.5,"HASFS-067073","HASFS-021","STOPFA 7177CONF","6773","M 8","SEILLAGER GROß","SLG",4,null,"DKM_AGM.standard","M 65",{"$f":"Q24&R24","v":"DKM_AGM.standardM 65"},"M 65","Lasche DKM/DKOM 65,5mm","D655",null,"1.015-20-24",47,109,166,null,null,null,null,null,null,null,null,null,null,null,null,null,null,null,null,null,null,null,"D165G",null,"angepaßt"]
["1SN-K",31,"1SN-KDN31",44,null,72.5,78,"HASFS-072078","HASFS-022","STOPFA 7682CONF","7278","M8","SEILLAGER GROß","SLG",4,null,"DKM_AGM.standard","M 78","DKM_AGM.standardM 78","M 78","Lasche DKM/DKOM 78,5mm","D785",null,"1.015-24-20",40,115,169,null,null,null,null,null,null,null,null,null,null,null,null,null,null,null,null,null,null,null,"D185G",null,"angepaßt"]
["2SC",6,"2SCDN6",13.6,null,78.5,85.5,"HASFS-079085","HASFS-024"," -","7985","M8","SEILLAGER GROß","SLG",4,null,"DKM_AGM.standard","M 90","DKM_AGM.standardM 90","M 90","Lasche DKM/DKOM 90,5mm","D905",null,"1.015-24-24",49,111,168,null,null,null,null,null,null,null,null,null,null,null,null,null,null,null,null,null,null,null,"D205G",null,"angepaßt"]
["2SC",8,"2SCDN8",15.2,null,85.5,91.5,"HASFS-086091","HASFS-025"," -","8691","M8","SEILLAGER GROß","SLG",4,null,"DKM_AGM.standard","M 100","DKM_AGM.standardM 100","M 100","Lasche DKM/DKOM 100,5mm","D1005",null,"1.015-24-32",54,111,186,null,null,null,null,null,null,null,null,null,null,null,null,null,null,null,null,null,null,null,"D225G",null,"angepaßt"]
["2SC",10,"2SCDN10",17.600000000000001,null,91.5,96.5,"HASFS-092096","HASFS-026"," -","9296","M8","SEILLAGER GROß","SLG",4,null,"DKR_AGR.standard","2\"","DKR_AGR.standard2\"","G 2\" (59,6)","Lasche DIN  2\"","D600",null,"1.015-32-24",49,111,168,null,null,null,null,null,null,null,null,null,null,null,null,null,null,null,null,null,null,null,"D245G",null,"angepaßt"]
["2SC",12,"2SCDN12",20.7,null,96.5,"-"," -","-"," -","-","-","-","-"," -",null,"DKR_AGR.standard","3\"","DKR_AGR.standard3\"","G 3\" (87,9)","Lasche DKM/DKOM 90,5mm","D905",null,"1.015-32-32",55,112,187,null,null,null,null,null,null,null,null,null,null,null,null,null,null,null,null,null,null,null,"D265G",null,"angepaßt"]
["2SC",16,"2SCDN16",23.7,null,null,null,null,null,null,null,null,null,null,null,null,"SAE","3000PSI_1/2\"",{"$f":"Q30&R30","v":"SAE3000PSI_1/2\""},"M 8","Lasche SAE D08.5","S085",null,"1.015-32-36",56,150,230,null,null,null,null,null,null,null,null,null,null,null,null,null,null,null,null,null,null,null,"D305G",null,"angepaßt"]
["2SC",19,"2SCDN19",27.7,null,null,null,null,null,null,null,null,null,null,null,null,"SAE","3000PSI_3/4\"","SAE3000PSI_3/4\"","M 10","Lasche SAE D10.5","S105",null,"1.015-40-32",50,116,191,null,null,null,null,null,null,null,null,null,null,null,null,null,null,null,null,null,null,null,"D365G",null,"angepaßt"]
["2SC",25,"2SCDN25",35.700000000000003,null,null,null,null,null,null,null,null,null,null,null,null,"SAE","3000PSI_1\"","SAE3000PSI_1\"","M 10","Lasche SAE D10.5","S105",null,"1.015-40-36",53,148,228,null,null,null,null,null,null,null,null,null,null,null,null,null,null,null,null,null,null,null,"D425G",null,"angepaßt"]
["2SN",6,{"$f":"A33&\"DN\"&B33","v":"2SNDN6"},15,null,null,null,null,null,null,null,null,null,null,null,null,"SAE","3000PSI_1_1/4\"","SAE3000PSI_1_1/4\"","M 10","Lasche SAE D10.5","S105",null,"1.019-12-12",61,60,99,null,null,null,null,null,null,null,null,null,null,null,null,null,null,null,null,null,null,null,"D455G",null,"angepaßt"]
["2SN",8,"2SNDN8",16.600000000000001,null,null,null,null,null,null,null,null,null,null,null,null,"SAE","3000PSI_1_1/2\"","SAE3000PSI_1_1/2\"","M 12","Lasche SAE D12.5","S125",null,"1.019-12-16",71,68,114,null,null,null,null,null,null,null,null,null,null,null,null,null,null,null,null,null,null,null,"D525G",null,"angepaßt"]
["2SN",10,"2SNDN10",19,null,null,null,null,null,null,null,null,null,null,null,null,"SAE","3000PSI_2\"","SAE3000PSI_2\"","M 12","Lasche SAE D12.5","S125",null,"1.019-16-12",62,60,99]
["2SN",12,"2SNDN12",22.2,null,null,null,null,null,null,null,null,null,null,null,null,"SAE","3000PSI_2_1/2\"","SAE3000PSI_2_1/2\"","M 12","Lasche SAE D12.5","S125",null,"1.019-16-16",69,68,114]
["2SN",16,"2SNDN16",25.4,null,null,null,null,null,null,null,null,null,null,null,null,"SAE","3000PSI_3\"","SAE3000PSI_3\"","M 16","Lasche SAE D16.5","S165",null,"1.019-16-20",84,94,148]
["2SN",19,"2SNDN19",29.3,null,null,null,null,null,null,null,null,null,null,null,null,"SAE","3000PSI_3_1/2\"","SAE3000PSI_3_1/2\"","M 16","Lasche SAE D16.5","S165",null,"1.019-20-16",70,68,114]
["2SN",25,"2SNDN25",38.1,null,null,null,null,null,null,null,null,null,null,null,null,"SAE","6000PSI_1/2\"",{"$f":"Q39&R39","v":"SAE6000PSI_1/2\""},"M 8","Lasche SAE D08.5","S085",null,"1.019-20-20",82,94,148]
["2SN",31,"2SNDN31",48.3,null,null,null,null,null,null,null,null,null,null,null,null,"SAE","6000PSI_3/4\"","SAE6000PSI_3/4\"","M 10","Lasche SAE D10.5","S105",null,"1.019-20-24",104,105,162]
{"$rows_left_out":712}
{"sheet":"Anfrage","index":4,"n_rows":59,"n_cols":11,"rows_kept":59,"cut":false,"hidden":false,"merged":[]}
[]
[]
[null,null,null,null,null,null,null,null,null,null,"i"]
[null,null,"Anfrage Schlauchfangsicherung",null,null,null,{"$f":"TODAY()","v":"2022-08-24"},null,null,null,0]
[]
[]
[null,null,"An:"]
[null,null,"Dietzel Hydraulik GmbH",null,null,"Tel.:","0049 36602 140 0"]
[null,null,"Leedenstraße 10"]
[null,null,"04626 Löbichau",null,null,"Email.:","Schlauchfangsicherung@dietzel-hydraulik.de"]
[]
[]
[null,null,"Absender:",null,null,{"$f":"+Eingabe!B9","v":"Ansprechpartner:"},{"$f":"+Eingabe!C9","v":"Herr Muster Mustermann"}]
[null,null,{"$f":"+Eingabe!C4","v":"Musterfirma"},null,null,{"$f":"+Eingabe!B10","v":"Tel.:"},{"$f":"+Eingabe!C10","v":"0049 1234567889"}]
[null,null,{"$f":"+Eingabe!C5","v":"Musterstraße"},null,null,{"$f":"+Eingabe!B11","v":"Fax:"},{"$f":"+Eingabe!C11","v":"0049 34567654"}]
[null,null,{"$f":"+Eingabe!C6","v":"07549"},null,null,{"$f":"+Eingabe!B12","v":"Email.:"},{"$f":"+Eingabe!C12","v":"muster@muster.de"}]
[]
[]
[null,null,"Wir bitten um Abgabe eines Angebotes über folgende Mengen:"]
[]
[null,null,null,"Anzahl",null,null,"Nummer"]
[]
[]
[]
[]
[]
[]
[]
[]
[]
[]
[]
[]
[]
[]
[]
[]
[]
[]
[]
{"$rows_left_out":20}
{"sheet":"Menü","index":5,"n_rows":22,"n_cols":10,"rows_kept":22,"cut":false,"hidden":false,"merged":[]}
[]
[]
[]
[]
[]
[]
[]
[null,null,null,null,"Herzlich Willkommen im Konfigurator für Schlauchfangsicherungen der Dietzel Hydraulik GmbH"]
[]
[null,null,null,null,"Sie befinden sich im Hauptmenü"]
[]
[null,null,null,null,"Sie haben nun folgende Auswahlmöglichkeiten:"]
[]
[]
[]
[]
[]
[]
[]
[]
[]
[null,null,null,null,null,null,null,null,"Konfigurator",{"$f":"+Auswahl!B2","v":"Stand: 24.05.2013 "}]